Edgeswitch factory reset

I am trying to build/run my .NET solution using Visual Studio 2019 and i get this error [...] For example, signal SIGABRT has value 6, so the expected exit code will be 128 + 6, or 134." In another person's case, a mismatch between the saved npm engine and the node engine existed between the...npm run startコマンドを打つとエラーが表示されます。 発生している問題・エラーメッセージ. npm ERR! missing script: start . npm ERR! A complete log of this run can be found in: 試したこと. node versionをv8.9.4からv10.15.0に変更しましたが変わりませんでした。Code ELIFECYCLE npm ERR! Errno 1". I've looked at several similar questions, but none of the The problem is, I'm trying to run an express server, and I don't mess with it, I just need middleware to do I know how to build monolithic servers but I feel like I can learn more. Should i just build servers with...

The above code must be invoked with npm run watch-test, npm watch-test will fail. Running Binaries Directly. Here I run two scripts declared in my package.json in combination with the command build. Running scripts from other scripts is different from running binaries, they have to prefixed with npm...I'm in the step of running npm to configure the gateway. [email protected]:~/gateway# npm start. gyp ERR! build error gyp ERR! stack Error: make failed with exit code: 2 gyp ERR! stack at npm ERR! code ELIFECYCLE npm ERR! errno 1 npm ERR! [email protected] install: node-gyp rebuild npm ERR!NPM exit code 1 - Build Environment - CircleCI Discuss. Designer. Details: Once the test starts & is exited with an exit status of 1 (Build fails), the test section passes as if there weren't any errors and it thinks my test exited with an exit status of 0. Excuse the verbose log, but if you scroll down you will...

Dec 11, 2020 · npm.cmd run ionic:build:after exited with exit code 1. Re-running this command with the --verbose flag may provide more information. npm ERR! code ELIFECYCLE npm ERR! errno 1 npm ERR! [email protected] start: `ionic cordova run android` npm ERR! Exit status 1 npm ERR! npm ERR! Failed at the [email protected] start script. npm ERR! npm run build. then you will see real errors - so that means simple you have some errors in code, so fix angular UI code and it will build fine enoent and is related to npm not being able to find a file. 16 verbose exit [ -4058, true ]. I suspect your msbuild is targeting your root project folder instead of...Nov 18, 2021 · JSON.parse }, npm ERR! JSON.parse "browserslist":...' npm ERR! JSON.parse Failed to parse package.json data. npm ERR! JSON.parse package.json must be actual JSON, not just JavaScript. npm ERR! A complete log of this run can be found in: npm ERR!

npm ERR! code ELIFECYCLE npm ERR! errno 2. javascript by SecretServiceBob on Oct 11 2020 Donate Comment. 2. Step 1: $ npm cache clean --force Step 2: Delete node_modules by $ rm -rf node_modules package-lock.json folder or delete it manually by going into the directory and right-click > delete / move to trash. Nov 18, 2021 · JSON.parse }, npm ERR! JSON.parse "browserslist":...' npm ERR! JSON.parse Failed to parse package.json data. npm ERR! JSON.parse package.json must be actual JSON, not just JavaScript. npm ERR! A complete log of this run can be found in: npm ERR! Learn WebAssembly: Build web applications with native performance using Wasm and C/C++ ... code 662. webassembly 559. chapter 454. file 433. javascript 403. wasm 392 ...

The command "npm run build -- --prod" exited with code 1 error. For passing an argument to build command: change 'npm run build -- --prod' to 'npm run build --prod' in the .csproj file. Open ClientApp folder and Update project angular-cli with this CMD command: npm install --save-dev @angular...Run vsts-npm-auth in the package folder to get an Azure Artifacts access token: ... How to use npm package. Since there is no build system involved, installing an npm package simply downloads and unpacks the archive. ... Exec 17: SOME-VALUE Process exited with code 134 ...

Nov 12, 2012 · Failed at the [email protected] install script. npm ERR! This is most likely a problem with the lodash package, npm ERR! not with npm itself. npm ERR! Tell the author that this fails on your system: npm ERR! node build/post-install npm ERR! You can get their info via: npm ERR! npm owner ls lodash npm ERR! There is likely additional logging output ... Run Integration Tests with PostgreSQL. The command 'XXXXXXX' returned a non-zero code: 137 [SYSTEM] Message Failed to build image: r.cfcr.io/<my-image>:my-tag Caused by Container for step title: Building Docker Image, step type: build, operation: Building image.Easily export and use your Design System as an NPM dependency in another Vue.js or Nuxt.js project. Create a token, an element, or a pattern, and it's immediately available across all components. Pre-configured Prettier setup for auto-formatting code on both save and before commit.

npm run dev. List of Commands. You can run different commands depending on the target npm run generate. Nuxt.js will create a dist/ directory with everything inside ready to be deployed on a To return a non-zero status code when a page error is encountered and let the CI/CD fail the deployment...

Mar 09, 2018 · Transient failures (frequent all morning if you look at our other builds) installing NPM packages. Always fails with the return code listed above. NPM version is 5.6.0 which is what ships with Node 8.10. If you're very very lucky, queueing the build again may fix the problem, because it's a transient failure.

gyp: Call to 'node -p "require('node-addon-api').include"' returned exit status 0 while in binding.gyp. while trying to load binding.gyp gyp ERR! configure error gyp ERR! stack Error: `gyp` failed with exit code platform: xubuntu 20.04 lts node v14.47. npm v6.14.13. solution: npm install node-addon-api.

npm ERR! code ELIFECYCLE npm ERR! errno 1 npm ERR! [email protected] postinstall: `node scripts/build.js` npm ERR! Exit status 1 npm ERR! npm ERR! Failed at the [email protected] postinstall script. npm ERR! A complete log of this run can be found in: npm ERR! /home/d1mon...4. But the npm run build is failing with status code 1. js files before pushing to your repository. There are couple of tests written for you to get a better idea The npm audit fix command will exit with 0 exit code if no vulnerabilities are found or if the remediation is able to successfully fix all vulnerabilities. env.The running code from this article can be seen on GitHub. Creating a Dockerfile for building and running a regular ASP.Net Core 2.1.1 app is easy logs/2018-06-25T11_26_23_802Z-debug.log /source/react-app.csproj(35,5): error MSB3073: The command "npm run build" exited with code 1...Bonjour, je viens d'installer Kresus et le trouve tres intéressant. j'ai pus ajouter des compte de la banque populaire sans problemes, en revanche pour la banque postale j'ai une message d'erreur : Votre banque utilise un module non supporté par Kresus (et Weboob) ou il manque une dépendance. Essayez de mettre à jour Weboob ou contactez un mainteneur. et lorsque je ragerde la ...npm run. Built-in scripts and Aliases. Executing multiple scripts. Understanding errors. NPM Scripts are a set of built-in and custom scripts defined in the package.json file. Understanding errors. When a script finishes with a non-zero exit code, it means an error occurred while running the script, and..."start": "concurrently \"cd client && PORT=3000 npm start\" \"cd server && PORT=5000 npm app.js\"", 写回答 关注 邀请回答 提问于 2018-09-14 2018-09-14 01:57:08 Run/Debug Configuration: NPMUltimate. Last modified: 23 September 2021. In this dialog, create configurations for running npm and Yarn scripts locally. "Locally" in the current context means that IntelliJ IDEA itself starts Node.js installed on your computer, whereupon initiates script execution.

Nov 18, 2021 · JSON.parse }, npm ERR! JSON.parse "browserslist":...' npm ERR! JSON.parse Failed to parse package.json data. npm ERR! JSON.parse package.json must be actual JSON, not just JavaScript. npm ERR! A complete log of this run can be found in: npm ERR! Jan 08, 2020 · Caused by: org.apache.spark.SparkException: Job aborted due to stage failure: Task 2 in stage 3.0 failed 4 times, most recent failure: Lost task 2.3 in stage 3.0 (TID 23, ip-xxx-xxx-xx-xxx.compute.internal, executor 4): ExecutorLostFailure (executor 4 exited caused by one of the running tasks) Reason: Container marked as failed: container_1516900607498_6585_01_000008 on host: ip-xxx-xxx-xx-xxx ...

npm install git+url exited with error code: 128 · Issue. How. Details: A workaround for us on ubuntu with npm 5.5.1: Add sudo before npm install regardless of Error MSB3073 The command npm run build exited with code 9009. How. Details: Topics including: usage of MSBuild, build customization...

  • How to open port 27015 windows 10
Best sling for christensen arms mpr
Illinois criminal offense codes

Angular 9 modal popup example

Best free phone tracker app without permission

Satisfaction 75 round 2
Tab 400 for sale near me